sample_id,patient_code,accession,IP,group,race,age,sex,hospitalized,intubated,alive,patient_group,WHO_score_patient,WHO_score_sample,days_symptoms_before_admission,days_since_hospitalization,days_since_symptoms,sample_under_intubation,days_since_intubation_start,days_since_tosilizumab_start,obesity,bmi,underlying_pulm_disease,CKD,HLD,Smoking,DM,HTN,hematological_malignancy,bone_marrow_transplant,XRAY,ARDS,thromboembolic_complications,CAD_MI,total_bilirubin,ALT,AST,creatinine,CRP,hemoglobin,hematocrit,LDH,RDWCV,MCV,HCQ,remdesivir,tosilizumab,steroids,informed_sample_type
IP17007,16.0,P020-075,IP17007,covid,asian,75.0,F,1.0,1.0,dead,severe,8.0,7.0,5.0,8.0,13.0,0,1.0,6.0,overweight,28.9,0.0,no,yes,no,no,yes,no,no,b/l pna,yes,no,no,0.4,80.0,59.0,0.6,1.08,12.1,35.3,765.0,12.5,97.2,yes,no,yes,yes,EDTA plasma
IP17008,61.0,P020-076,IP17008,covid,white,38.0,M,1.0,0.0,alive,severe,5.0,3.0,10.0,14.0,24.0,0,,11.0,obese,46.4,1.0,no,no,no,no,no,no,no,b/l pna,no,no,no,,,,0.7,0.11,14.2,41.9,380.0,13.6,91.9,yes,no,yes,no,EDTA plasma
IP17011,62.0,P020-077,IP17011,covid,black or aa,38.0,F,1.0,0.0,alive,moderate,3.0,3.0,14.0,3.0,17.0,0,,,obese,51.3,0.0,no,no,no,no,no,no,no,no pna,no,no,no,,,,0.8,7.46,10.9,32.2,,18.1,68.0,yes,no,no,no,EDTA plasma
IP17012,63.0,P020-079,IP17012,covid,asian,65.0,F,1.0,0.0,alive,severe,5.0,5.0,7.0,3.0,10.0,0,,1.0,nonobese,21.0,0.0,no,yes,yes,yes,yes,no,no,b/l pna,no,no,no,0.6,24.0,49.0,0.7,21.62,11.3,33.6,595.0,13.5,89.3,yes,no,yes,no,EDTA plasma
IP17015,205.0,,IP17015,covid,white,69.0,M,1.0,0.0,alive,mild,3.0,3.0,10.0,6.0,16.0,0,,,nonobese,,0.0,no,yes,former,no,no,yes,no,bl pna,no,no,no,0.6,129.0,35.0,0.55,1.4,9.7,29.5,160.0,12.5,91.7,yes,no,no,yes,EDTA plasma
IP17019,26.0,P020-082,IP17019,covid,white,66.0,M,1.0,0.0,alive,moderate,4.0,2.0,7.0,11.0,18.0,0,,,obese,32.23,0.0,no,no,no,no,yes,yes,yes,left PNA,no,no,no,0.6,43.0,23.0,1.26,,10.7,32.3,187.0,18.2,84.9,yes,no,no,no,EDTA plasma
IP17020,27.0,P020-083,IP17020,covid,asian,49.0,M,1.0,1.0,alive,severe,7.0,4.0,7.0,17.0,24.0,1,16.0,,nonobese,21.5,0.0,yes,no,UNKN,no,yes,no,no,b/l pna,yes,no,no,,,,5.7,16.0,5.6,17.3,256.0,17.2,84.7,yes,no,no,yes,EDTA plasma
IP17022,24.0,P020-084,IP17022,covid,white,57.0,M,1.0,1.0,dead,severe,8.0,5.0,7.0,2.0,9.0,0,-7.0,0.0,overweight,29.9,0.0,no,no,no,yes,yes,no,no,b/l pna,yes,no,no,1.3,106.0,73.0,0.64,23.2,13.0,38.2,488.0,13.9,89.1,yes,no,yes,yes,EDTA plasma
IP17028,45.0,P020-078,IP17028,covid,white,50.0,F,0.0,0.0,alive,low,2.0,2.0,,,16.0,0,,,nonobese,20.48,0.0,no,no,no,no,no,no,no,no x ray,no,no,no,,,,,,,,,,,no,no,no,no,EDTA plasma
IP17032,64.0,P020-085,IP17032,covid,white,67.0,M,1.0,0.0,alive,moderate,4.0,4.0,7.0,5.0,12.0,0,,,obese,30.5,0.0,no,no,no,no,no,no,no,b/l pna,no,no,no,0.4,67.0,77.0,0.6,11.75,12.1,37.1,428.0,16.4,79.8,yes,no,no,no,EDTA plasma
IP17036,23.0,P020-086,IP17036,covid,white,73.0,F,1.0,1.0,alive,severe,7.0,5.0,6.0,9.0,15.0,0,-4.0,-4.0,nonobese,21.9,0.0,no,yes,former,no,no,yes,no,b/l pna,yes,yes,no,,,,0.45,,7.8,23.9,414.0,19.1,85.6,yes,no,yes,yes,EDTA plasma
IP17037,65.0,P020-087,IP17037,covid,white,65.0,F,1.0,0.0,alive,moderate,4.0,4.0,4.0,8.0,12.0,0,,,overweight,29.0,0.0,no,no,no,no,no,yes,no,b/l pna,no,no,no,0.5,34.0,36.0,0.52,30.4,8.1,24.1,266.0,13.5,88.8,yes,yes,no,no,EDTA plasma
IP17038,66.0,P020-088,IP17038,non-covid,white,43.0,M,1.0,0.0,alive,,,,,,,0,,,obese,35.9,1.0,no,yes,no,yes,yes,yes,yes,negative,no,no,no,0.4,13.0,9.0,1.21,,9.8,29.3,,14.5,93.0,,,,yes,EDTA plasma
IP17039,67.0,P020-089,IP17039,covid,black or aa,85.0,M,1.0,0.0,alive,moderate,3.0,3.0,2.0,17.0,19.0,0,,,nonobese,21.3,0.0,no,no,no,no,yes,yes,no,b/l pna,no,no,yes,0.4,39.0,33.0,0.93,0.0,10.3,31.8,349.0,16.1,88.4,no,no,no,no,EDTA plasma
IP17040,59.0,P020-090,IP17040,covid,white,64.0,M,1.0,0.0,dead,severe,5.0,5.0,6.0,9.0,15.0,0,,,obese,31.6,1.0,no,yes,yes,yes,yes,no,no,b/l pna,no,no,no,,,,0.9,16.55,13.6,40.2,315.0,13.0,92.7,no,no,no,yes,EDTA plasma
IP17041,16.0,P020-091,IP17041,covid,asian,75.0,F,1.0,1.0,dead,severe,8.0,7.0,5.0,14.0,19.0,0,7.0,12.0,overweight,28.9,0.0,no,yes,no,no,yes,no,no,b/l pna,yes,no,no,0.4,55.0,48.0,0.7,1.12,12.4,38.2,542.0,14.0,100.7,yes,no,yes,yes,EDTA plasma
IP17042,68.0,P020-092,IP17042,non-covid,white,74.0,M,1.0,0.0,alive,,,,,,,0,,,nonobese,20.5,0.0,no,no,former,no,yes,yes,no,b/l pna,no,no,no,0.7,9.0,18.0,1.23,10.8,6.2,19.5,239.0,19.0,87.8,,,,no,EDTA plasma
IP17047,70.0,P020-095,IP17047,non-covid,white,30.0,F,1.0,0.0,alive,,,,,,,0,,,nonobese,,0.0,no,no,no,no,no,yes,yes,pna,no,no,no,,,,,,,,,,,,,,no,EDTA plasma
IP17048,21.0,P020-096,IP17048,covid,white,70.0,F,1.0,0.0,alive,moderate,3.0,3.0,14.0,5.0,19.0,0,,,overweight,26.7,0.0,no,no,no,no,yes,yes,no,bl pna,no,no,no,1.1,43.0,35.0,0.51,7.2,11.6,33.5,,15.5,88.7,no,no,no,no,EDTA plasma
IP17049,63.0,P020-097,IP17049,covid,asian,65.0,F,1.0,0.0,alive,severe,5.0,5.0,7.0,11.0,18.0,0,,9.0,nonobese,21.0,0.0,no,yes,yes,yes,yes,no,no,b/l pna,no,no,no,0.5,30.0,41.0,0.74,,11.2,33.9,,13.5,88.8,yes,no,yes,no,EDTA plasma
IP17054,25.0,P020-099,IP17054,covid,asian,72.0,F,1.0,0.0,alive,severe,5.0,5.0,14.0,2.0,16.0,0,,1.0,nonobese,,1.0,no,yes,no,no,no,no,no,b/l pna,yes,no,no,,,,0.3,5.74,13.1,39.2,566.0,13.4,84.1,yes,no,yes,yes,EDTA plasma
IP17057,1.0,P020-100,IP17057,convalescent,white,57.0,M,0.0,0.0,alive,low,1.0,0.0,,,90.0,0,,,nonobese,27.17,,,,,,,,no,no,no,no,no,,,,,,,,,,,,,,,EDTA plasma
IP17058,2.0,P020-101,IP17058,convalescent,white,55.0,F,0.0,0.0,alive,low,1.0,0.0,,,90.0,0,,,nonobese,23.89,,,,,,,,no,no,no,no,no,,,,,,,,,,,,,,,EDTA plasma
IP17059,3.0,P020-102,IP17059,convalescent,white,26.0,F,0.0,0.0,alive,low,1.0,0.0,,,90.0,0,,,nonobese,23.29,,,,,,,,no,no,no,no,no,,,,,,,,,,,,,,,EDTA plasma
IP17061,4.0,P020-103,IP17061,covid,asian,65.0,M,1.0,0.0,alive,severe,5.0,5.0,4.0,4.0,8.0,0,,1.0,overweight,28.7,0.0,no,no,no,no,no,no,no,b/l pna,no,no,no,0.9,35.0,38.0,0.9,18.14,12.0,36.7,368.0,14.7,90.8,yes,no,yes,yes,EDTA plasma
IP17063,5.0,P020-104,IP17063,convalescent,white,44.0,M,0.0,0.0,alive,low,1.0,0.0,,,90.0,0,,,nonobese,26.11,,,,,,,,no,no,no,no,no,,,,,,,,,,,,,,,EDTA plasma
IP17064,6.0,P020-105,IP17064,convalescent,white,39.0,M,0.0,0.0,alive,low,1.0,0.0,,,90.0,0,,,nonobese,26.17,,,,,,,,no,no,no,no,no,,,,,,,,,,,,,,,EDTA plasma
IP17065,7.0,P020-106,IP17065,convalescent,white,53.0,M,0.0,0.0,alive,low,1.0,0.0,,,90.0,0,,,nonobese,26.58,,,,,,,,no,no,no,no,no,,,,,,,,,,,,,,,EDTA plasma
IP17066,8.0,P020-107,IP17066,covid,asian,38.0,M,0.0,0.0,alive,low,2.0,1.0,6.0,,26.0,0,,,obese,36.25,0.0,no,no,no,yes,yes,yes,no,no x ray,no,no,no,1.0,59.0,139.0,0.94,,16.9,50.2,,13.6,89.3,no,no,no,no,EDTA plasma
IP17067,9.0,P020-108,IP17067,covid,asian,29.0,F,0.0,0.0,alive,low,1.0,1.0,26.0,,28.0,0,,,overweight,25.3,0.0,no,no,no,no,no,no,no,no PNA,no,no,no,0.2,12.0,20.0,0.6,,10.5,31.6,,13.4,95.2,no,no,no,no,EDTA plasma
IP17068,10.0,P020-109,IP17068,covid,white,47.0,M,1.0,0.0,alive,low,1.0,1.0,0.0,7.0,7.0,0,,,nonobese,24.7,0.0,no,no,yes,no,no,no,no,no PNA,no,no,no,,,,,,,,,,,,no,no,no,EDTA plasma
IP17069,11.0,P020-110,IP17069,covid,white,76.0,M,1.0,0.0,alive,moderate,4.0,4.0,14.0,15.0,29.0,0,,,overweight,28.4,0.0,no,no,former,no,yes,no,no,b/l pna,no,no,no,,,,0.8,1.08,11.1,34.4,,82.3,15.1,yes,no,no,no,EDTA plasma
IP17070,12.0,P020-111,IP17070,covid,white,76.0,F,1.0,0.0,alive,moderate,5.0,4.0,3.0,7.0,10.0,0,,,overweight,29.5,0.0,no,yes,no,yes,yes,no,no,b/l pna,no,no,no,,,,0.6,,11.6,37.4,,79.3,17.5,no,no,no,no,EDTA plasma
IP17071,13.0,P020-112,IP17071,covid,white,66.0,M,0.0,0.0,alive,low,2.0,1.0,2.0,,42.0,0,,,overweight,27.8,0.0,no,no,no,no,no,yes,no,no x ray,no,no,no,1.6,14.0,19.0,0.9,,9.8,31.4,,16.8,79.9,no,no,no,no,EDTA plasma
IP17072,14.0,P020-113,IP17072,covid,white,42.0,M,0.0,0.0,alive,low,1.0,1.0,2.0,,16.0,0,,,overweight,29.99,0.0,no,no,no,no,no,yes,no,no PNA,no,no,no,,,,,,,,,,,no,no,no,no,EDTA plasma
IP17076,15.0,P020-114,IP17076,covid,asian,48.0,M,1.0,1.0,dead,severe,8.0,7.0,17.0,12.0,29.0,0,12.0,5.0,nonobese,23.5,0.0,no,no,no,no,no,no,yes,b/l PNA,yes,no,no,0.6,21.0,33.0,5.84,2.9,7.9,22.7,907.0,20.7,100.9,yes,no,yes,yes,EDTA plasma
IP17077,16.0,P020-115,IP17077,covid,asian,75.0,F,1.0,1.0,dead,severe,8.0,7.0,5.0,21.0,26.0,0,14.0,19.0,overweight,28.9,0.0,no,yes,no,no,yes,no,no,b/l pna,yes,no,no,0.9,286.0,139.0,1.7,6.1,6.9,21.5,,14.8,97.8,yes,no,yes,yes,EDTA plasma
IP17078,17.0,P020-116,IP17078,covid,black or aa,59.0,M,1.0,0.0,alive,moderate,4.0,4.0,14.0,2.0,16.0,0,,,overweight,28.7,0.0,yes,yes,no,no,yes,no,no,b/l pna,no,yes,no,0.6,35.0,30.0,1.1,7.43,11.8,36.8,237.0,14.7,81.8,no,no,no,no,EDTA plasma
IP17080,18.0,P020-117,IP17080,covid,white,82.0,M,1.0,0.0,alive,severe,5.0,4.0,10.0,3.0,13.0,0,,1.0,obese,30.9,1.0,yes,yes,former,yes,yes,no,no,b/l pna,no,no,no,0.8,29.0,27.0,7.0,32.0,11.8,35.9,,13.7,96.1,no,no,yes,yes,EDTA plasma
IP17081,19.0,P020-118,IP17081,covid,asian,68.0,F,1.0,0.0,alive,moderate,4.0,4.0,7.0,1.0,8.0,0,,,obese,30.8,0.0,no,yes,no,no,yes,no,no,b/l pna,no,no,no,0.5,22.0,26.0,0.6,3.2,11.6,35.0,354.0,12.9,91.1,no,no,no,no,EDTA plasma
IP17082,21.0,P020-120,IP17082,covid,white,70.0,F,1.0,0.0,alive,moderate,3.0,2.0,14.0,11.0,25.0,0,,,overweight,26.7,0.0,no,no,no,no,yes,yes,no,bl pna,no,no,no,0.9,52.0,40.0,0.67,7.2,13.7,39.3,334.0,15.8,88.0,no,no,no,no,EDTA plasma
IP17084,22.0,P020-121,IP17084,covid,black or aa,44.0,M,0.0,0.0,alive,low,2.0,1.0,7.0,,35.0,0,,,obese,32.72,0.0,no,no,no,no,yes,yes,no,no x ray,no,no,no,0.4,27.0,22.0,0.58,,11.7,37.1,,21.8,84.3,no,no,no,no,EDTA plasma
IP17089,15.0,P020-122,IP17089,covid,asian,48.0,M,1.0,1.0,dead,severe,8.0,7.0,17.0,16.0,33.0,0,16.0,9.0,nonobese,23.5,0.0,no,no,no,no,no,no,yes,b/l PNA,yes,no,no,1.6,37.0,267.0,3.32,11.1,8.2,24.0,,20.5,104.0,yes,no,yes,yes,EDTA plasma
IP17090,23.0,P020-123,IP17090,covid,white,73.0,F,1.0,1.0,alive,severe,7.0,7.0,6.0,20.0,26.0,1,7.0,7.0,nonobese,21.9,0.0,no,yes,former,no,no,yes,no,b/l pna,yes,yes,no,0.8,20.0,31.0,0.42,,8.4,86.2,,26.0,92.7,yes,no,yes,yes,EDTA plasma
IP17091,24.0,P020-124,IP17091,covid,white,57.0,M,1.0,1.0,dead,severe,8.0,7.0,7.0,16.0,23.0,0,7.0,14.0,overweight,29.9,0.0,no,no,no,yes,yes,no,no,b/l pna,yes,no,no,,,,0.79,,11.2,33.8,,14.4,88.7,no,no,yes,yes,EDTA plasma
IP17092,25.0,P020-125,IP17092,covid,asian,72.0,F,1.0,0.0,alive,severe,5.0,5.0,14.0,9.0,23.0,0,,8.0,nonobese,,1.0,no,yes,no,no,no,no,no,b/l pna,yes,no,no,0.4,35.0,22.0,0.7,,14.3,42.1,,13.6,84.4,no,no,yes,yes,EDTA plasma
IP17093,26.0,P020-126,IP17093,covid,white,66.0,M,1.0,0.0,alive,moderate,4.0,1.0,7.0,26.0,33.0,0,,,obese,32.23,0.0,no,no,no,no,yes,yes,yes,bl pna,no,no,no,0.6,22.0,19.0,1.2,,10.2,31.3,173.0,22.5,87.0,no,no,no,no,EDTA plasma
IP17094,4.0,P020-127,IP17094,covid,asian,65.0,M,1.0,0.0,alive,severe,5.0,4.0,4.0,11.0,15.0,0,,8.0,overweight,28.7,0.0,no,no,no,no,no,no,no,b/l pna,no,no,no,,,,0.8,,13.8,41.6,,14.6,90.9,yes,no,yes,no,EDTA plasma
IP17096,27.0,P020-128,IP17096,covid,asian,49.0,M,1.0,1.0,alive,severe,7.0,3.0,7.0,33.0,40.0,1,32.0,,nonobese,21.5,0.0,yes,no,UNKN,no,yes,no,no,b/l pna,yes,no,no,,,,4.23,,8.3,24.7,,20.5,87.0,yes,no,no,yes,EDTA plasma
IP17100,32.0,P020-139,IP17100,covid,white,49.0,M,1.0,1.0,dead,severe,8.0,7.0,3.0,4.0,7.0,0,3.0,,nonobese,22.6,0.0,no,no,no,no,no,no,no,b/l pna,yes,no,no,1.0,57.0,110.0,2.2,29.5,8.4,24.8,,15.4,87.1,yes,no,no,no,EDTA plasma
IP17101,33.0,P020-140,IP17101,convalescent,white,33.0,M,0.0,0.0,alive,low,1.0,0.0,,,90.0,0,,,overweight,27.3,0.0,no,no,no,no,no,no,no,no x ray,no,no,no,,,,,,,,,,,no,no,no,no,EDTA plasma
IP17102,17.0,P020-141,IP17102,covid,black or aa,59.0,M,1.0,0.0,alive,moderate,4.0,4.0,21.0,9.0,30.0,0,,,overweight,28.7,0.0,yes,yes,no,no,yes,no,no,b/l pna,no,yes,no,,,,1.4,,12.5,38.0,,15.1,80.3,no,no,no,no,EDTA plasma
IP17103,18.0,P020-142,IP17103,covid,white,82.0,M,1.0,0.0,alive,severe,5.0,5.0,10.0,9.0,19.0,0,,7.0,obese,30.9,1.0,yes,yes,former,yes,yes,no,no,b/l pna,no,no,no,0.8,30.0,37.0,7.5,6.52,12.6,38.2,813.0,13.5,95.6,no,no,yes,yes,EDTA plasma
IP17104,16.0,P020-143,IP17104,covid,asian,75.0,F,1.0,1.0,dead,severe,8.0,7.0,5.0,28.0,33.0,0,21.0,26.0,overweight,28.9,0.0,no,yes,no,no,yes,no,no,b/l pna,yes,no,no,0.9,152.0,61.0,1.3,10.14,6.4,20.3,765.0,20.5,97.5,yes,no,yes,yes,EDTA plasma
IP17109,34.0,P020-144,IP17109,covid,white,36.0,F,1.0,0.0,dead,severe,3.0,1.0,21.0,35.0,56.0,0,,,nonobese,21.14,0.0,no,no,no,no,no,yes,yes,b/l pna,no,no,no,0.7,15.0,20.0,0.64,,11.0,32.9,148.0,15.3,92.4,no,no,no,yes,EDTA plasma
IP17115,24.0,P020-147,IP17115,covid,white,57.0,M,1.0,1.0,dead,severe,8.0,7.0,7.0,23.0,30.0,0,14.0,21.0,overweight,29.9,0.0,no,no,no,yes,yes,no,no,b/l pna,yes,no,no,0.3,20.0,14.0,0.36,,7.8,23.5,,15.5,90.4,no,no,yes,yes,EDTA plasma
IP17116,37.0,,IP17116,covid,,73.0,M,1.0,0.0,alive,moderate,5.0,5.0,2.0,5.0,7.0,0,,4.0,obese,29.1,1.0,no,yes,former,no,yes,no,no,b/l pna,no,no,no,,,,,,,,,,,no,yes,yes,yes,EDTA plasma
IP17117,25.0,P020-154,IP17117,covid,asian,72.0,F,1.0,0.0,alive,severe,5.0,4.0,14.0,16.0,30.0,0,,15.0,nonobese,,1.0,no,yes,no,no,no,no,no,b/l pna,yes,no,no,,,,,,,,,,,no,no,yes,yes,EDTA plasma
IP17118,38.0,P020-158,IP17118,covid,white,53.0,F,1.0,0.0,alive,mild,1.0,3.0,30.0,1.0,31.0,0,,,obese,25.7,1.0,no,no,no,no,no,no,no,negative,no,no,no,1.2,18.0,86.0,1.0,,13.9,40.9,,14.5,82.6,no,no,no,no,EDTA plasma
IP17121,40.0,P020-182,IP17121,covid,white,79.0,F,1.0,0.0,alive,severe,7.0,4.0,14.0,54.0,68.0,0,,,nonobese,22.5,1.0,no,yes,no,no,no,no,no,b/l pna,yes,no,no,0.5,23.0,17.0,0.62,,8.5,25.8,,16.6,91.2,yes,no,no,no,EDTA plasma
IP17124,41.0,P020-183,IP17124,covid,white,68.0,M,0.0,0.0,alive,mild,1.0,1.0,0.0,,14.0,0,,,obese,30.94,0.0,no,no,former,no,no,yes,yes,,no,no,no,0.3,9.0,12.0,0.68,,8.8,26.9,254.0,17.7,107.5,no,no,no,yes,EDTA plasma
IP17126,206.0,,IP17126,covid,asian,29.0,F,1.0,0.0,alive,mild,1.0,1.0,0.0,4.0,4.0,0,,,nonobese,,0.0,no,no,no,no,no,yes,yes,no pna,no,no,no,0.6,22.0,18.0,0.92,,8.2,24.1,286.0,18.4,107.4,no,no,no,no,EDTA plasma
IP17129,16.0,P020-186,IP17129,covid,asian,75.0,F,1.0,1.0,dead,severe,8.0,7.0,5.0,35.0,40.0,0,28.0,33.0,overweight,28.9,0.0,no,yes,no,no,yes,no,no,b/l pna,yes,no,no,0.6,90.0,29.0,2.4,10.5,7.1,21.9,,22.5,98.5,yes,no,yes,yes,EDTA plasma
IP17130,18.0,P020-187,IP17130,covid,white,82.0,M,1.0,0.0,alive,severe,5.0,4.0,10.0,16.0,26.0,0,,14.0,obese,30.9,1.0,yes,yes,former,yes,yes,no,no,b/l pna,no,no,no,0.7,39.0,41.0,7.1,4.22,11.5,34.8,548.0,14.3,96.0,no,no,yes,yes,EDTA plasma
IP17133,32.0,P020-188,IP17133,covid,white,92.0,M,1.0,1.0,dead,severe,8.0,7.0,3.0,11.0,14.0,0,10.0,,nonobese,22.6,0.0,no,no,no,no,no,no,no,b/l pna,yes,no,no,,,,2.98,10.3,10.0,29.5,,15.7,91.2,yes,no,no,no,EDTA plasma
IP17147,37.0,P020-189,IP17147,covid,,73.0,M,1.0,0.0,alive,moderate,5.0,5.0,2.0,13.0,15.0,0,,12.0,obese,29.1,1.0,no,yes,former,no,yes,no,no,b/l pna,no,no,no,0.6,57.0,24.0,0.6,0.06,14.3,42.7,505.0,14.7,85.9,no,yes,yes,yes,EDTA plasma
IP17148,39.0,P020-190,IP17148,covid,white,67.0,F,1.0,1.0,alive,severe,7.0,7.0,6.0,39.0,45.0,0,28.0,,obese,33.0,0.0,yes,no,no,no,yes,no,no,b/l pna,yes,yes,no,0.5,20.0,23.0,1.14,22.6,7.9,24.7,480.0,20.2,92.1,yes,no,no,yes,EDTA plasma
IP17151,24.0,P020-191,IP17151,covid,white,57.0,M,1.0,1.0,dead,severe,8.0,7.0,7.0,31.0,38.0,0,22.0,29.0,overweight,29.9,0.0,no,no,no,yes,yes,no,no,b/l pna,yes,no,no,0.3,14.0,23.0,0.8,,8.2,24.5,,17.1,93.1,no,no,yes,yes,EDTA plasma
IP17152,23.0,P020-192,IP17152,covid,white,73.0,F,1.0,1.0,alive,severe,7.0,3.0,6.0,36.0,42.0,0,23.0,23.0,nonobese,21.9,0.0,no,yes,former,no,no,yes,no,b/l pna,yes,yes,no,0.5,45.0,37.0,0.35,,9.2,28.3,264.0,22.3,97.3,yes,no,yes,yes,EDTA plasma
IP17153,44.0,P020-193,IP17153,covid,white,53.0,M,1.0,0.0,alive,mild,3.0,3.0,20.0,2.0,22.0,0,,,nonobese,26.5,0.0,no,no,yes,no,no,no,no,negative,no,no,no,,,,0.9,1.17,,,239.0,,,yes,no,no,yes,EDTA plasma
IP17163,45.0,P020-195,IP17163,covid,white,50.0,F,0.0,0.0,alive,low,1.0,1.0,,,45.0,0,,,nonobese,20.48,0.0,no,no,no,no,no,no,no,no x ray,no,no,no,,,,,,,,,,,no,no,no,no,EDTA plasma
IP17167,18.0,P020-196,IP17167,covid,white,82.0,M,1.0,0.0,alive,severe,5.0,4.0,10.0,23.0,33.0,0,,21.0,obese,30.9,1.0,yes,yes,former,yes,yes,no,no,b/l pna,no,no,no,,,,5.6,,10.5,31.6,,15.1,97.7,no,no,yes,yes,EDTA plasma
IP17168,16.0,P020-197,IP17168,covid,asian,75.0,F,1.0,1.0,dead,severe,8.0,7.0,5.0,42.0,47.0,0,35.0,40.0,overweight,28.9,0.0,no,yes,no,no,yes,no,no,b/l pna,yes,no,no,0.4,42.0,28.0,2.0,,8.2,25.3,,20.2,95.9,yes,no,yes,yes,EDTA plasma
IP17169,46.0,P020-198,IP17169,control,white,25.0,F,0.0,0.0,alive,uninfected,0.0,0.0,,,,0,,,nonobese,,,,,,,,,no,no,no,,,,,,,,,,,,,,,,,EDTA plasma
IP17170,47.0,P020-199,IP17170,control,white,29.0,F,0.0,0.0,alive,uninfected,0.0,0.0,,,,0,,,nonobese,,,,,,,,,no,no,no,,,,,,,,,,,,,,,,,EDTA plasma
IP17179,48.0,P020-205,IP17179,covid,white,62.0,F,1.0,0.0,alive,mild,3.0,3.0,1.0,5.0,6.0,0,,,nonobese,22.1,0.0,no,no,former,no,no,yes,yes,b/l pna,no,no,no,0.7,24.0,28.0,0.69,5.6,8.5,25.8,,16.6,91.6,no,yes,no,no,EDTA plasma
IP17180,37.0,P020-206,IP17180,covid,,73.0,M,1.0,0.0,alive,moderate,5.0,4.0,2.0,20.0,22.0,0,,19.0,obese,29.1,1.0,no,yes,former,no,yes,no,no,b/l pna,no,no,no,0.7,50.0,23.0,0.6,,13.1,39.5,,16.4,87.5,no,yes,yes,yes,EDTA plasma
IP17191,18.0,P020-209,IP17191,covid,white,82.0,M,1.0,0.0,alive,severe,5.0,4.0,10.0,30.0,40.0,0,,28.0,obese,30.9,1.0,yes,yes,former,yes,yes,no,no,b/l pna,no,no,no,,,,5.0,,10.6,32.6,,15.0,96.9,no,no,yes,yes,EDTA plasma
IP17192,16.0,P020-210,IP17192,covid,asian,75.0,F,1.0,1.0,dead,severe,8.0,7.0,5.0,49.0,54.0,0,42.0,47.0,overweight,28.9,0.0,no,yes,no,no,yes,no,no,b/l pna,yes,no,no,0.5,12.0,22.0,1.8,,8.8,27.6,,19.2,97.7,yes,no,yes,yes,EDTA plasma
IP17193,49.0,P020-211,IP17193,covid,white,64.0,M,1.0,0.0,alive,mild,3.0,3.0,14.0,4.0,18.0,0,,,obese,32.5,0.0,no,yes,no,no,no,yes,yes,b/l pna,no,no,no,0.6,72.0,52.0,0.98,1.5,12.1,35.4,354.0,12.8,94.4,no,yes,no,no,EDTA plasma
IP17213,52.0,P020-214,IP17213,convalescent,white,42.0,F,0.0,0.0,alive,low,2.0,0.0,,,90.0,0,,,nonobese,26.6,0.0,no,no,no,no,no,no,no,no x ray,no,,,,,,,,,,,,,,,,,EDTA plasma
IP17214,53.0,P020-215,IP17214,convalescent,white,27.0,F,0.0,0.0,alive,low,2.0,0.0,,,90.0,0,,,nonobese,,1.0,no,no,no,no,no,no,no,no x ray,no,,,,,,,,,,,,,,,,,EDTA plasma
IP17215,54.0,P020-216,IP17215,convalescent,white,55.0,M,,0.0,alive,,,0.0,,,90.0,0,,,,,,,,,,,,,,no,,,,,,,,,,,,,,,,,EDTA plasma
IP17216,55.0,P020-217,IP17216,convalescent,asian,43.0,F,0.0,0.0,alive,low,2.0,0.0,,,90.0,0,,,nonobese,,1.0,no,no,no,no,no,no,no,no x ray,no,,,,,,,,,,,,,,,,,EDTA plasma
IP17217,56.0,P020-218,IP17217,convalescent,white,48.0,F,,0.0,alive,,,0.0,,,90.0,0,,,,,,,,,,,,,,no,,,,,,,,,,,,,,,,,EDTA plasma
IP17218,57.0,P020-219,IP17218,convalescent,asian,,M,,0.0,alive,,,0.0,,,90.0,0,,,,,,,,,,,,,,no,,,,,,,,,,,,,,,,,EDTA plasma
IP17219,58.0,P020-220,IP17219,convalescent,white,44.0,M,0.0,0.0,alive,low,2.0,0.0,,,90.0,0,,,obese,30.0,1.0,no,yes,no,no,no,no,no,no x ray,no,,,,,,,,,,,,,,,,,EDTA plasma
IP17227,72.0,P020-224,IP17227,convalescent,white,33.0,M,,0.0,alive,,,0.0,,,90.0,0,,,,,,,,,,,,,,no,,,,,,,,,,,,,,,,,EDTA plasma
IP17236,73.0,P020-225,IP17236,covid,black or aa,71.0,M,1.0,1.0,alive,severe,7.0,6.0,4.0,64.0,68.0,0,63.0,,nonobese,26.9,0.0,no,yes,no,yes,yes,no,no,b/l pna,yes,yes,yes,0.3,12.0,9.0,0.34,,8.5,25.9,,16.9,91.7,yes,no,no,yes,EDTA plasma
IP17237,39.0,P020-226,IP17237,covid,white,67.0,F,1.0,1.0,alive,severe,7.0,7.0,6.0,55.0,61.0,0,44.0,,obese,33.0,0.0,yes,no,no,no,yes,no,no,b/l pna,yes,yes,no,0.4,9.0,26.0,2.3,,7.7,23.9,,20.7,99.1,yes,no,no,yes,EDTA plasma
IP17238,74.0,P020-227,IP17238,covid,other,74.0,M,1.0,1.0,alive,severe,7.0,7.0,7.0,70.0,77.0,0,65.0,,overweight,26.3,0.0,no,no,former,no,no,no,no,b/l pna,yes,no,no,0.2,44.0,40.0,0.21,,8.2,26.6,,19.4,85.5,yes,no,no,yes,EDTA plasma
IP17239,75.0,P020-228,IP17239,convalescent,white,41.0,M,,0.0,alive,,,0.0,,,90.0,0,,,nonobese,22.5,,,,,,,,,,no,,,,,,,,,,,,,,,,,EDTA plasma
IP17241,94.0,P020-252,IP17241,covid,white,85.0,M,1.0,1.0,dead,severe,8.0,7.0,2.0,10.0,12.0,0,31.0,,overweight,26.5,0.0,no,yes,no,yes,yes,no,no,b/l pna,yes,yes,no,0.9,59.0,74.0,1.78,,12.5,40.2,,15.2,88.5,no,yes,no,yes,EDTA plasma
IP17246,76.0,P020-229,IP17246,convalescent,white,56.0,M,,0.0,alive,low,,0.0,,,90.0,0,,,overweight,29.99,0.0,no,yes,no,no,no,no,no,no x ray,no,,,,,,,,,,,,,,,,,EDTA plasma
IP17246b,,,IP17246b,,,,,,,,,,,,,,0,,,,,,,,,,,,,,,,,,,,,,,,,,,,,,,EDTA plasma
IP17247,77.0,P020-230,IP17247,convalescent,white,35.0,F,,0.0,alive,,,0.0,,,90.0,0,,,,,,,,,,,,,,no,,,,,,,,,,,,,,,,,EDTA plasma
IP17248,78.0,P020-231,IP17248,convalescent,,30.0,F,0.0,0.0,alive,low,2.0,0.0,,,90.0,0,,,overweight,28.72,0.0,no,no,no,no,no,no,no,no x ray,no,no,no,,,,,,,,,,,,,,,EDTA plasma
IP17249,79.0,P020-232,IP17249,convalescent,white,47.0,F,0.0,0.0,alive,low,2.0,0.0,,,90.0,0,,,nonobese,,0.0,no,no,no,no,no,no,no,no x ray,no,no,no,,,,,,,,,,,,,,,EDTA plasma
IP17251,49.0,P020-234,IP17251,covid,white,64.0,M,1.0,0.0,alive,mild,3.0,3.0,14.0,15.0,29.0,0,,,obese,32.5,0.0,no,yes,no,no,no,yes,yes,b/l pna,no,no,no,0.8,32.0,95.0,1.0,,12.4,35.9,427.0,13.7,94.5,no,yes,no,no,EDTA plasma
IP17252,48.0,P020-235,IP17252,covid,white,62.0,F,1.0,0.0,alive,mild,3.0,0.0,1.0,18.0,19.0,0,,,nonobese,22.1,0.0,no,no,former,no,no,yes,yes,b/l pna,no,no,no,0.6,16.0,20.0,0.88,,9.7,29.5,,17.2,94.0,no,yes,no,no,EDTA plasma
IP17257,81.0,P020-236,IP17257,convalescent,black or aa,43.0,F,0.0,0.0,alive,low,2.0,0.0,,,90.0,0,,,obese,30.45,0.0,no,no,quit,no,no,no,no,,no,,no,,,,,,,,,,,,,,,EDTA plasma
IP17258,82.0,P020-237,IP17258,convalescent,white,42.0,F,,0.0,alive,,,0.0,,,90.0,0,,,nonobese,,,,,,,,,,,no,,no,,,,,,,,,,,,,,,EDTA plasma
IP17263,26.0,P020-240,IP17263,covid,white,66.0,M,1.0,0.0,alive,moderate,4.0,1.0,7.0,61.0,68.0,0,,,obese,32.23,0.0,no,no,no,no,yes,yes,yes,bl pna,no,no,no,0.5,28.0,24.0,1.25,,11.6,34.9,177.0,20.5,89.7,no,no,no,no,EDTA plasma
IP17266,85.0,P020-241,IP17266,convalescent,white,32.0,M,0.0,0.0,alive,low,2.0,0.0,,,90.0,0,,,nonobese,,0.0,no,no,no,no,no,no,no,no x ray,no,no,no,,,,,,,,,,,,,,,EDTA plasma
IP17267,86.0,P020-242,IP17267,convalescent,white,30.0,F,0.0,0.0,alive,low,2.0,0.0,,,90.0,0,,,nonobese,,0.0,no,no,no,no,no,no,no,no x ray,no,no,no,,,,,,,,,,,,,,,EDTA plasma
IP17281,88.0,P020-244,IP17281,convalescent,white,35.0,M,,0.0,alive,,,0.0,,,90.0,0,,,,,,,,,,,,,,no,,no,,,,,,,,,,,,,,,EDTA plasma
IP17282,89.0,P020-245,IP17282,convalescent,white,28.0,F,,0.0,alive,,,0.0,,,90.0,0,,,,,,,,,,,,,,no,,no,,,,,,,,,,,,,,,EDTA plasma
IP17284,91.0,P020-247,IP17284,convalescent,white,37.0,M,0.0,0.0,alive,low,2.0,0.0,,,90.0,0,,,obese,37.97,0.0,no,no,no,yes,yes,no,no,,no,,no,,,,,,,,,,,,,,,EDTA plasma
IP17295,66.0,P020-251,IP17295,non-covid,white,43.0,M,1.0,0.0,alive,,,,,,,0,,,obese,35.9,1.0,no,yes,no,yes,yes,yes,yes,negative,no,no,no,0.4,33.0,21.0,1.1,,10.7,31.8,305.0,18.5,87.9,,,,yes,EDTA plasma
IP17390,33.0,P020-263,IP17390,convalescent,white,33.0,M,0.0,0.0,alive,low,1.0,0.0,,,90.0,0,,,overweight,27.3,0.0,no,no,no,no,no,no,no,no x ray,no,no,no,,,,,,,,,,,no,no,no,no,EDTA plasma
IP17393,97.0,P020-265,IP17393,convalescent,other,66.0,M,1.0,0.0,alive,moderate,4.0,0.0,,,90.0,0,,,overweight,27.47,0.0,no,no,no,no,no,no,no,b/l pna,no,no,no,,,,,,,,,,,,,,,EDTA plasma
IP17394,100.0,P020-265,IP17394,convalescent,white,59.0,F,0.0,0.0,alive,low,2.0,0.0,,,90.0,0,,,nonobese,24.8,0.0,no,no,no,no,no,no,no,no x ray,no,no,no,,,,,,,,,,,no,no,no,no,EDTA plasma
IP17395,74.0,P020-268,IP17395,covid,other,74.0,M,1.0,1.0,alive,severe,7.0,6.0,7.0,97.0,104.0,0,92.0,,overweight,26.3,0.0,no,no,former,no,no,no,no,b/l pna,yes,no,no,0.4,27.0,33.0,0.32,,8.2,27.4,,16.2,94.8,yes,no,no,yes,EDTA plasma
IP17396,94.0,P020-267,IP17396,covid,white,85.0,M,1.0,1.0,dead,severe,8.0,7.0,2.0,37.0,39.0,0,58.0,,overweight,26.5,0.0,no,yes,no,yes,yes,no,no,b/l pna,yes,yes,no,0.5,9.0,22.0,3.08,,7.5,24.8,,18.4,93.6,no,yes,no,yes,EDTA plasma
IP17421,95.0,P020-272,IP17421,control,white,60.0,M,0.0,0.0,alive,uninfected,0.0,0.0,,,,0,,,nonobese,,,,,,,,,no,no,no,,,,,,,,,,,,,,,,,EDTA plasma
IP17422,96.0,P020-273,IP17422,control,white,60.0,F,0.0,0.0,alive,uninfected,0.0,0.0,,,,0,,,nonobese,,,,,,,,,no,no,no,,,,,,,,,,,,,,,,,EDTA plasma
IP17693,202.0,P020-283,IP17693,control,asian,,M,0.0,0.0,alive,uninfected,0.0,0.0,,,,0,,,nonobese,,,,,,,,,no,no,no,,,,,,,,,,,,,,,,,EDTA plasma